Target
E3 ubiquitin-protein ligase XIAP
Ligand
BDBM44291
Substrate
Meas. Tech.
ChEMBL_757198 (CHEMBL1803422)
Ki
1670±n/a nM
Citation
 González-López, MWelsh, KFinlay, DArdecky, RJGanji, SRSu, YYuan, HTeriete, PMace, PDRiedl, SJVuori, KReed, JCCosford, ND Design, synthesis and evaluation of monovalent Smac mimetics that bind to the BIR2 domain of the anti-apoptotic protein XIAP. Bioorg Med Chem Lett 21:4332-6 (2011)  
Target
Name:
E3 ubiquitin-protein ligase XIAP
Synonyms:
API3 E3 ubiquitin-protein ligase XIAP Inhibitor of apoptosis protein 3 X-linked inhibitor of apoptosis XIAP | XIAP_HUMAN
Type:
Protein
Mol. Mass.:
56685.27
Organism:
Homo sapiens (Human)
Description:
P98170
Residue:
497
  
Inhibitor
Name:
BDBM44291
Synonyms:
(2S)-N-(diphenylmethyl)-1-[(2S)-4-methyl-2-[[(2S)-2-(methylamino)-1-oxopropyl]amino]-1-oxopentyl]-2-pyrrolidinecarboxamide;formic acid (2S)-N-benzhydryl-1-[(2S)-4-methyl-2-[[(2S)-2-(methylamino)propanoyl]amino]pentanoyl]pyrrolidine-2-carboxamide;formic acid MLS-0391026.0001 | cid_44182152
Type:
Small organic molecule
Emp. Form.:
C28H38N4O3
Mol. Mass.:
478.6263
SMILES:
CN[C@@H](C)C(=O)N[C@@H](CC(C)C)C(=O)N1CCC[C@H]1C(=O)NC(c1ccccc1)c1ccccc1
: