Target
Interstitial collagenase
Ligand
BDBM50348663
Substrate
Meas. Tech.
ChEMBL_754458 (CHEMBL1806083)
IC50
>10000±n/a nM
Citation
 Becker, DPBarta, TEBedell, LJBoehm, TLBond, BRCarroll, JCarron, CPDecrescenzo, GAEaston, AMFreskos, JNFunckes-Shippy, CLHeron, MHockerman, SHoward, CPKiefer, JRLi, MHMathis, KJMcDonald, JJMehta, PPMunie, GESunyer, TSwearingen, CAVillamil, CIWelsch, DWilliams, JMYu, YYao, J Orally active MMP-1 sparinga-tetrahydropyranyl anda-piperidinyl sulfone matrix metalloproteinase (MMP) inhibitors with efficacy in cancer, arthritis, and cardiovascular disease. J Med Chem 53:6653-80 (2010)  
Target
Name:
Interstitial collagenase
Synonyms:
CLG MMP1 Matrix metalloproteinase-1 | Matrix metalloproteinase-1 (MMP-1)
Type:
Enzyme
Mol. Mass.:
54010.26
Organism:
Homo sapiens (Human)
Description:
P03956
Residue:
469
  
Inhibitor
Name:
BDBM50348663
Synonyms:
CHEMBL1801418
Type:
Small organic molecule
Emp. Form.:
C22H24N2O7S2
Mol. Mass.:
492.565
SMILES:
CS(=O)(=O)c1ccc(Oc2ccc(cc2)S(=O)(=O)C2(CCN(CC#C)CC2)C(=O)NO)cc1
: