Target
Thymidylate synthase
Ligand
BDBM50350127
Substrate
Meas. Tech.
ChEMBL_760996 (CHEMBL1815024)
Ki
61000±n/a nM
Citation
 Mangani, SCancian, LLeone, RPozzi, CLazzari, SLuciani, RFerrari, SCosti, MP Identification of the binding modes of N-phenylphthalimides inhibiting bacterial thymidylate synthase through X-ray crystallography screening. J Med Chem 54:5454-67 (2011)  
Target
Name:
Thymidylate synthase
Synonyms:
TS TYSY_ENTFA | thyA
Type:
PROTEIN
Mol. Mass.:
36331.56
Organism:
Enterococcus faecalis
Description:
ChEMBL_760996
Residue:
315
  
Inhibitor
Name:
BDBM50350127
Synonyms:
CHEMBL1814082
Type:
Small organic molecule
Emp. Form.:
C15H11NO3
Mol. Mass.:
253.2527
SMILES:
Cc1cccc2C(=O)N(C(=O)c12)c1cccc(O)c1
: