Target
Dipeptidyl peptidase 4
Ligand
BDBM50350169
Substrate
Meas. Tech.
ChEMBL_761367 (CHEMBL1816905)
IC50
>50000±n/a nM
Citation
 Van Goethem, SMatheeussen, VJoossens, JLambeir, AMChen, XDe Meester, IHaemers, AAugustyns, KVan der Veken, P Structure-activity relationship studies on isoindoline inhibitors of dipeptidyl peptidases 8 and 9 (DPP8, DPP9): is DPP8-selectivity an attainable goal? J Med Chem 54:5737-46 (2011)  
Target
Name:
Dipeptidyl peptidase 4
Synonyms:
ADABP Adenosine deaminase complexing protein 2 CD_antigen=CD26 DPP4 DPPIV Dipeptidyl peptidase 4 (DPP IV) Dipeptidyl peptidase 4 (DPP4) Dipeptidyl peptidase 4 membrane form Dipeptidyl peptidase IV Dipeptidyl peptidase IV (DDP-IV) Dipeptidyl peptidase IV membrane form Dipeptidyl peptidase-IV (DPP-4) T-cell activation antigen CD26 | TP103
Type:
Enzyme
Mol. Mass.:
88271.01
Organism:
Homo sapiens (Human)
Description:
P27487
Residue:
766
  
Inhibitor
Name:
BDBM50350169
Synonyms:
CHEMBL1814633 US11559537, Compound 4160(1G-244)
Type:
Small organic molecule
Emp. Form.:
C29H30F2N4O2
Mol. Mass.:
504.5709
SMILES:
N[C@@H](CC(=O)N1CCN(CC1)C(c1ccc(F)cc1)c1ccc(F)cc1)C(=O)N1Cc2ccccc2C1
: