Target
Dipeptidyl peptidase 8
Ligand
BDBM50350175
Substrate
Meas. Tech.
ChEMBL_761370 (CHEMBL1816908)
Ki
37±n/a nM
Citation
 Van Goethem, SMatheeussen, VJoossens, JLambeir, AMChen, XDe Meester, IHaemers, AAugustyns, KVan der Veken, P Structure-activity relationship studies on isoindoline inhibitors of dipeptidyl peptidases 8 and 9 (DPP8, DPP9): is DPP8-selectivity an attainable goal? J Med Chem 54:5737-46 (2011)  
Target
Name:
Dipeptidyl peptidase 8
Synonyms:
DPP8 DPRP-1 Dipeptidyl peptidase 8 (DPP-8) Dipeptidyl peptidase 8/9 Dipeptidyl peptidase VIII Prolyl dipeptidase DPP8
Type:
Enzyme
Mol. Mass.:
103342.62
Organism:
Homo sapiens (Human)
Description:
Q6V1X1
Residue:
898
  
Inhibitor
Name:
BDBM50350175
Synonyms:
CHEMBL1814749
Type:
Small organic molecule
Emp. Form.:
C30H32F2N4O2
Mol. Mass.:
518.5975
SMILES:
C[C@@H]1CN(CCN1C(c1ccc(F)cc1)c1ccc(F)cc1)C(=O)C[C@H](N)C(=O)N1Cc2ccccc2C1
: