Target
Angiotensin-converting enzyme
Ligand
BDBM50350673
Substrate
Meas. Tech.
ChEMBL_762422 (CHEMBL1816595)
IC50
2220000±n/a nM
Citation
 Kantevari, SAddla, DBagul, PKSridhar, BBanerjee, SK Synthesis and evaluation of novel 2-butyl-4-chloro-1-methylimidazole embedded chalcones and pyrazoles as angiotensin converting enzyme (ACE) inhibitors. Bioorg Med Chem 19:4772-81 (2011)  
Target
Name:
Angiotensin-converting enzyme
Synonyms:
3.2.1.- ACE Angiotensin-converting enzyme, soluble form DCP1 Kininase II
Type:
Mol. Mass.:
150405.15
Organism:
Oryctolagus cuniculus
Description:
Residue:
1310
  
Inhibitor
Name:
BDBM50350673
Synonyms:
CHEMBL1813743
Type:
Small organic molecule
Emp. Form.:
C19H22ClN5O3
Mol. Mass.:
403.863
SMILES:
CCCCc1nc(Cl)c(C2CC(=NN2C(C)=O)c2ccc(cc2)[N+]([O-])=O)n1C
: