Target
Hepatocyte growth factor receptor
Ligand
BDBM50242737
Substrate
Meas. Tech.
ChEMBL_764847 (CHEMBL1826790)
IC50
9±n/a nM
Citation
 Xie, QQZhong, LPan, YLWang, XYZhou, JPDi-Wu, LHuang, QWang, YLYang, LLXie, HZYang, SY Combined SVM-based and docking-based virtual screening for retrieving novel inhibitors of c-Met. Eur J Med Chem 46:3675-80 (2011)  
Target
Name:
Hepatocyte growth factor receptor
Synonyms:
Hepatocyte growth factor receptor Hepatocyte growth factor receptor (c-MET) MET Met proto-oncogene (hepatocyte growth factor receptor) Tyrosine-protein kinase Met (c-Met) c-Met kinase
Type:
Protein
Mol. Mass.:
155559.73
Organism:
Homo sapiens (Human)
Description:
P08581
Residue:
1390
  
Inhibitor
Name:
BDBM50242737
Synonyms:
(R,Z)-5-(2,6-dichlorobenzylsulfonyl)-3-((3,5-dimethyl-4-(2-(pyrrolidin-1-ylmethyl)pyrrolidine-1-carbonyl)-1H-pyrrol-2-yl)methylene)indolin-2-one PHA-665752 | TCMDC-125885
Type:
Small organic molecule
Emp. Form.:
C32H34Cl2N4O4S
Mol. Mass.:
641.608
SMILES:
Cc1[nH]c(\C=C2/C(=O)Nc3ccc(cc23)S(=O)(=O)Cc2c(Cl)cccc2Cl)c(C)c1C(=O)N1CCC[C@@H]1CN1CCCC1
: