Target
Nitric oxide synthase, brain
Ligand
BDBM50352591
Substrate
Meas. Tech.
ChEMBL_767473 (CHEMBL1825585)
IC50
70±n/a nM
Citation
 Renton, PSpeed, JMaddaford, SAnnedi, SCRamnauth, JRakhit, SAndrews, J 1,5-Disubstituted indole derivatives as selective human neuronal nitric oxide synthase inhibitors. Bioorg Med Chem Lett 21:5301-4 (2011)  
Target
Name:
Nitric oxide synthase, brain
Synonyms:
Constitutive NOS NC-NOS NOS type I nNOS NOS1_HUMAN Neuronal nitric oxide synthase Nitric oxide synthase, neuronal (nNOS) bNOS | nNOS
Type:
Homodimer
Mol. Mass.:
160985.98
Organism:
Homo sapiens (Human)
Description:
P29475
Residue:
1434
  
Inhibitor
Name:
BDBM50352591
Synonyms:
CHEMBL1825172
Type:
Small organic molecule
Emp. Form.:
C20H24N4S
Mol. Mass.:
352.496
SMILES:
CN1CCCC1CCn1ccc2cc(ccc12)N=C(N)c1cccs1
: