Target
Smoothened homolog
Ligand
BDBM50352935
Substrate
Meas. Tech.
ChEMBL_767699 (CHEMBL1825811)
IC50
26±n/a nM
Citation
 Brown, MLAaron, WAustin, RJChong, AHuang, TJiang, BKaizerman, JALee, GLucas, BSMcMinn, DLOrf, JRong, MToteva, MMXu, GYe, QZhong, WDegraffenreid, MRWickramasinghe, DPowers, JPHungate, RJohnson, MG Discovery of amide replacements that improve activity and metabolic stability of a bis-amide smoothened antagonist hit. Bioorg Med Chem Lett 21:5206-9 (2011)  
Target
Name:
Smoothened homolog
Synonyms:
SMO_MOUSE Smoh
Type:
PROTEIN
Mol. Mass.:
87472.73
Organism:
Mus musculus
Description:
ChEMBL_1510377
Residue:
793
  
Inhibitor
Name:
BDBM50352935
Synonyms:
CHEMBL1824916
Type:
Small organic molecule
Emp. Form.:
C24H17ClN2O
Mol. Mass.:
384.858
SMILES:
Clc1ccccc1C(=O)Nc1ccc(cc1)-c1cc(ccn1)-c1ccccc1
: