Target
Protein-tyrosine kinase 6
Ligand
BDBM50354429
Substrate
Meas. Tech.
ChEMBL_771345 (CHEMBL1839617)
IC50
5±n/a nM
Citation
 Zeng, HBelanger, DBCurran, PJShipps, GWMiao, HBracken, JBArshad Siddiqui, MMalkowski, MWang, Y Discovery of novel imidazo[1,2-a]pyrazin-8-amines as Brk/PTK6 inhibitors. Bioorg Med Chem Lett 21:5870-5 (2011)  
Target
Name:
Protein-tyrosine kinase 6
Synonyms:
BRK KH domain-containing, RNA-binding, signal transduction-associated protein 1 PTK6_HUMAN Tyrosine Kinase BRK Tyrosine-protein kinase BRK
Type:
Tyrosine-protein kinase
Mol. Mass.:
51839.11
Organism:
Homo sapiens (Human)
Description:
Residue:
451
  
Inhibitor
Name:
BDBM50354429
Synonyms:
CHEMBL1836846
Type:
Small organic molecule
Emp. Form.:
C25H25ClN8O
Mol. Mass.:
488.972
SMILES:
Clc1cc(Nc2nc(cn3c(cnc23)-c2cn[nH]c2)C2CC2)ccc1C(=O)N1C[C@H]2CC[C@@H]1CN2
: