Target
Misshapen-like kinase 1
Ligand
BDBM31088
Substrate
Meas. Tech.
ChEMBL_774293 (CHEMBL1908510)
Kd
>10000±n/a nM
Citation
 Davis, MIHunt, JPHerrgard, SCiceri, PWodicka, LMPallares, GHocker, MTreiber, DKZarrinkar, PP Comprehensive analysis of kinase inhibitor selectivity. Nat Biotechnol 29:1046-51 (2011)  
Target
Name:
Misshapen-like kinase 1
Synonyms:
B55 MAP4K6 MEK kinase kinase 6 MINK MINK1_HUMAN Misshapen/NIK-related kinase Voltage-gated potassium channel subunit Kv7.1/Misshapen-like kinase 1 ZC3
Type:
PROTEIN
Mol. Mass.:
149838.92
Organism:
Homo sapiens (Human)
Description:
ChEMBL_793919
Residue:
1332
  
Inhibitor
Name:
BDBM31088
Synonyms:
1-methyl-5-[2-[5-(trifluoromethyl)-1H-imidazol-2-yl]pyridin-4-yl]oxy-N-[4-(trifluoromethyl)phenyl]benzimidazol-2-amine CHIR-265 cid_11656518
Type:
Small organic molecule
Emp. Form.:
C24H16F6N6O
Mol. Mass.:
518.4139
SMILES:
Cn1c(Nc2ccc(cc2)C(F)(F)F)nc2cc(Oc3ccnc(c3)-c3ncc([nH]3)C(F)(F)F)ccc12
: