Target
Calcium/calmodulin-dependent protein kinase type II subunit alpha
Ligand
BDBM50355500
Substrate
Meas. Tech.
ChEMBL_774210 (CHEMBL1908427)
Kd
1000±n/a nM
Citation
 Davis, MIHunt, JPHerrgard, SCiceri, PWodicka, LMPallares, GHocker, MTreiber, DKZarrinkar, PP Comprehensive analysis of kinase inhibitor selectivity. Nat Biotechnol 29:1046-51 (2011)  
Target
Name:
Calcium/calmodulin-dependent protein kinase type II subunit alpha
Synonyms:
CAMK2A CaM kinase II Calcium/calmodulin-dependent protein kinase type II subunit alpha (CAMK2a) KIAA0968
Type:
Enzyme Catalytic Domain
Mol. Mass.:
54093.63
Organism:
Homo sapiens (Human)
Description:
gi_25952118
Residue:
478
  
Inhibitor
Name:
BDBM50355500
Synonyms:
CHEMBL1908394 | US9695172, GSK461364
Type:
Small organic molecule
Emp. Form.:
C27H28F3N5O2S
Mol. Mass.:
543.604
SMILES:
C[C@@H](Oc1cc(sc1C(N)=O)-n1cnc2ccc(CN3CCN(C)CC3)cc12)c1ccccc1C(F)(F)F
: