Target
Serine/threonine-protein kinase SIK3 [59-1321]
Ligand
BDBM50326053
Substrate
Meas. Tech.
ChEMBL_774254 (CHEMBL1908471)
Kd
98±n/a nM
Citation
 Davis, MIHunt, JPHerrgard, SCiceri, PWodicka, LMPallares, GHocker, MTreiber, DKZarrinkar, PP Comprehensive analysis of kinase inhibitor selectivity. Nat Biotechnol 29:1046-51 (2011)  
Target
Name:
Serine/threonine-protein kinase SIK3 [59-1321]
Synonyms:
KIAA0999 QSK SIK3 Salt-inducible kinase 3 Serine/threonine-protein kinase SIK3
Type:
PROTEIN
Mol. Mass.:
139984.87
Organism:
Homo sapiens (Human)
Description:
ChEMBL_774254
Residue:
1263
  
Inhibitor
Name:
BDBM50326053
Synonyms:
CHEMBL608533 | PKC-412
Type:
Small organic molecule
Emp. Form.:
C35H30N4O4
Mol. Mass.:
570.6371
SMILES:
CO[C@@H]1[C@@H](C[C@H]2O[C@]1(C)n1c3ccccc3c3c4CNC(=O)c4c4c5ccccc5n2c4c13)N(C)C(=O)c1ccccc1
: