Target
Calcium/calmodulin-dependent protein kinase kinase 2
Ligand
BDBM50308060
Substrate
Meas. Tech.
ChEMBL_774540 (CHEMBL1908757)
Kd
15±n/a nM
Citation
 Davis, MIHunt, JPHerrgard, SCiceri, PWodicka, LMPallares, GHocker, MTreiber, DKZarrinkar, PP Comprehensive analysis of kinase inhibitor selectivity. Nat Biotechnol 29:1046-51 (2011)  
Target
Name:
Calcium/calmodulin-dependent protein kinase kinase 2
Synonyms:
CAMKK2 Calcium/calmodulin-dependent protein kinase kinase 2 (CaMKKB) KIAA0787 | KKCC2_HUMAN
Type:
Enzyme Catalytic Domain
Mol. Mass.:
64746.61
Organism:
Homo sapiens (Human)
Description:
gi_27437015
Residue:
588
  
Inhibitor
Name:
BDBM50308060
Synonyms:
16-hydroxy-16-(hydroxymethyl)-15-methyl-28-oxa-4,14,19-triazaoctacyclo[12.11.2.1^{15,18}.0^{2,6}.0^{7,27}.0^{8,13}.0^{19,26}.0^{20,25}]octacosa-1(26),2(6),7(27),8(13),9,11,20(25),21,23-nonaen-3-one CHEMBL603469 | US11370779, Compound CEP-701
Type:
Small organic molecule
Emp. Form.:
C26H21N3O4
Mol. Mass.:
439.4626
SMILES:
C[C@]12O[C@H](C[C@]1(O)CO)n1c3ccccc3c3c4C(=O)NCc4c4c5ccccc5n2c4c13
: