Target
eIF-2-alpha kinase GCN2
Ligand
BDBM50161957
Substrate
Meas. Tech.
ChEMBL_774290 (CHEMBL1908507)
Kd
96±n/a nM
Citation
 Davis, MIHunt, JPHerrgard, SCiceri, PWodicka, LMPallares, GHocker, MTreiber, DKZarrinkar, PP Comprehensive analysis of kinase inhibitor selectivity. Nat Biotechnol 29:1046-51 (2011)  
Target
Name:
eIF-2-alpha kinase GCN2
Synonyms:
E2AK4_HUMAN Eukaryotic translation initiation factor 2-alpha kinase 4 GCN2(Kin.Dom.2 S808G) KIAA1338
Type:
PROTEIN
Mol. Mass.:
186899.26
Organism:
Homo sapiens (Human)
Description:
ChEMBL_1495738
Residue:
1649
  
Inhibitor
Name:
BDBM50161957
Synonyms:
4-Dimethylamino-but-2-enoic acid {4-[3-chloro-4-(pyridin-2-ylmethoxy)-phenylamino]-3-cyano-7-ethoxy-quinolin-6-yl}-amide HKI-272 N-(4-(3-chloro-4-(pyridin-2-ylmethoxy)phenylamino)-3-cyano-7-ethoxyquinolin-6-yl)-4-(dimethylamino)butanamide US10822334, Compound Neratinib US20230382923, Compound Neratinib
Type:
Small organic molecule
Emp. Form.:
C30H29ClN6O3
Mol. Mass.:
557.043
SMILES:
CCOc1cc2ncc(C#N)c(Nc3ccc(OCc4ccccn4)c(Cl)c3)c2cc1NC(=O)\C=C\CN(C)C
: