Target
Phosphatidylinositol 4-phosphate 5-kinase type-1 gamma
Ligand
BDBM50326053
Substrate
Meas. Tech.
ChEMBL_774231 (CHEMBL1908448)
Kd
>10000±n/a nM
Citation
 Davis, MIHunt, JPHerrgard, SCiceri, PWodicka, LMPallares, GHocker, MTreiber, DKZarrinkar, PP Comprehensive analysis of kinase inhibitor selectivity. Nat Biotechnol 29:1046-51 (2011)  
Target
Name:
Phosphatidylinositol 4-phosphate 5-kinase type-1 gamma
Synonyms:
KIAA0589 PIP5K1-gamma PIP5KIgamma Phosphatidylinositol 4-phosphate 5-kinase type-1 gamma PtdIns(4)P-5-kinase 1 gamma
Type:
PROTEIN
Mol. Mass.:
73241.99
Organism:
Homo sapiens (Human)
Description:
ChEMBL_1508846
Residue:
668
  
Inhibitor
Name:
BDBM50326053
Synonyms:
CHEMBL608533 | PKC-412
Type:
Small organic molecule
Emp. Form.:
C35H30N4O4
Mol. Mass.:
570.6371
SMILES:
CO[C@@H]1[C@@H](C[C@H]2O[C@]1(C)n1c3ccccc3c3c4CNC(=O)c4c4c5ccccc5n2c4c13)N(C)C(=O)c1ccccc1
: