Target
Serine/threonine-protein kinase ICK
Ligand
BDBM50326053
Substrate
Meas. Tech.
ChEMBL_774570 (CHEMBL1908787)
Kd
5900±n/a nM
Citation
 Davis, MIHunt, JPHerrgard, SCiceri, PWodicka, LMPallares, GHocker, MTreiber, DKZarrinkar, PP Comprehensive analysis of kinase inhibitor selectivity. Nat Biotechnol 29:1046-51 (2011)  
Target
Name:
Serine/threonine-protein kinase ICK
Synonyms:
CILK1 ICK KIAA0936 Laryngeal cancer kinase 2 MRK | hICK
Type:
PROTEIN
Mol. Mass.:
71470.23
Organism:
Homo sapiens (Human)
Description:
ChEMBL_774570
Residue:
632
  
Inhibitor
Name:
BDBM50326053
Synonyms:
CHEMBL608533 | PKC-412
Type:
Small organic molecule
Emp. Form.:
C35H30N4O4
Mol. Mass.:
570.6371
SMILES:
CO[C@@H]1[C@@H](C[C@H]2O[C@]1(C)n1c3ccccc3c3c4CNC(=O)c4c4c5ccccc5n2c4c13)N(C)C(=O)c1ccccc1
: