Target
Myosin light chain kinase 3
Ligand
BDBM50026612
Substrate
Meas. Tech.
ChEMBL_774218 (CHEMBL1908435)
Kd
110±n/a nM
Citation
 Davis, MIHunt, JPHerrgard, SCiceri, PWodicka, LMPallares, GHocker, MTreiber, DKZarrinkar, PP Comprehensive analysis of kinase inhibitor selectivity. Nat Biotechnol 29:1046-51 (2011)  
Target
Name:
Myosin light chain kinase 3
Synonyms:
MLCK MYLK3_HUMAN | Myosin light chain kinase
Type:
PROTEIN
Mol. Mass.:
88384.80
Organism:
Homo sapiens (Human)
Description:
ChEMBL_774218
Residue:
819
  
Inhibitor
Name:
BDBM50026612
Synonyms:
BIBF-1120 US10981896, Compound Nintedanib US11208381, Nintedanib | Vargatef
Type:
Small organic molecule
Emp. Form.:
C31H33N5O4
Mol. Mass.:
539.6248
SMILES:
COC(=O)c1ccc2\C(=C(\Nc3ccc(cc3)N(C)C(=O)CN3CCN(C)CC3)c3ccccc3)C(=O)Nc2c1
: