Target
Dual specificity mitogen-activated protein kinase kinase 7
Ligand
BDBM50026612
Substrate
Meas. Tech.
ChEMBL_774202 (CHEMBL1908419)
Kd
>10000±n/a nM
Citation
 Davis, MIHunt, JPHerrgard, SCiceri, PWodicka, LMPallares, GHocker, MTreiber, DKZarrinkar, PP Comprehensive analysis of kinase inhibitor selectivity. Nat Biotechnol 29:1046-51 (2011)  
Target
Name:
Dual specificity mitogen-activated protein kinase kinase 7
Synonyms:
Dual specificity mitogen-activated protein kinase kinase 7 JNKK2 MEK7 MP2K7_HUMAN SKK4
Type:
Protein
Mol. Mass.:
47502.52
Organism:
Homo sapiens (Human)
Description:
O14733
Residue:
419
  
Inhibitor
Name:
BDBM50026612
Synonyms:
BIBF-1120 US10981896, Compound Nintedanib US11208381, Nintedanib | Vargatef
Type:
Small organic molecule
Emp. Form.:
C31H33N5O4
Mol. Mass.:
539.6248
SMILES:
COC(=O)c1ccc2\C(=C(\Nc3ccc(cc3)N(C)C(=O)CN3CCN(C)CC3)c3ccccc3)C(=O)Nc2c1
: