Target
Rhodopsin kinase GRK7
Ligand
BDBM50331096
Substrate
Meas. Tech.
ChEMBL_774199 (CHEMBL1908416)
Kd
>10000±n/a nM
Citation
 Davis, MIHunt, JPHerrgard, SCiceri, PWodicka, LMPallares, GHocker, MTreiber, DKZarrinkar, PP Comprehensive analysis of kinase inhibitor selectivity. Nat Biotechnol 29:1046-51 (2011)  
Target
Name:
Rhodopsin kinase GRK7
Synonyms:
G protein-coupled receptor kinase 7 GRK7 | GRK7_HUMAN
Type:
PROTEIN
Mol. Mass.:
62210.84
Organism:
Homo sapiens (Human)
Description:
ChEMBL_774199
Residue:
553
  
Inhibitor
Name:
BDBM50331096
Synonyms:
4-(4-fluoro-2-methyl-1H-indol-5-yloxy)-6-methoxy-7-(3-(pyrrolidin-1-yl)propoxy)quinazoline Cediranib ZD-2171
Type:
Small organic molecule
Emp. Form.:
C25H27FN4O3
Mol. Mass.:
450.5053
SMILES:
COc1cc2c(Oc3ccc4[nH]c(C)cc4c3F)ncnc2cc1OCCCN1CCCC1
: