Target
Muscle, skeletal receptor tyrosine-protein kinase
Ligand
BDBM25121
Substrate
Meas. Tech.
ChEMBL_774502 (CHEMBL1908719)
Kd
>10000±n/a nM
Citation
 Davis, MIHunt, JPHerrgard, SCiceri, PWodicka, LMPallares, GHocker, MTreiber, DKZarrinkar, PP Comprehensive analysis of kinase inhibitor selectivity. Nat Biotechnol 29:1046-51 (2011)  
Target
Name:
Muscle, skeletal receptor tyrosine-protein kinase
Synonyms:
MUSK Muscle, skeletal receptor tyrosine protein kinase
Type:
PROTEIN
Mol. Mass.:
97062.85
Organism:
Homo sapiens (Human)
Description:
ChEMBL_1474077
Residue:
869
  
Inhibitor
Name:
BDBM25121
Synonyms:
4-{[(7R)-8-cyclopentyl-7-ethyl-5-methyl-6-oxo-5,6,7,8-tetrahydropteridin-2-yl]amino}-3-methoxy-N-(1-methylpiperidin-4-yl)benzamide CHEMBL513909 US8598172, 5
Type:
Small organic molecule
Emp. Form.:
C28H39N7O3
Mol. Mass.:
521.6544
SMILES:
CC[C@H]1N(C2CCCC2)c2nc(Nc3ccc(cc3OC)C(=O)NC3CCN(C)CC3)ncc2N(C)C1=O
: