Target
Serine/threonine-protein kinase SIK3 [59-1321]
Ligand
BDBM25617
Substrate
Meas. Tech.
ChEMBL_774254 (CHEMBL1908471)
Kd
>10000±n/a nM
Citation
 Davis, MIHunt, JPHerrgard, SCiceri, PWodicka, LMPallares, GHocker, MTreiber, DKZarrinkar, PP Comprehensive analysis of kinase inhibitor selectivity. Nat Biotechnol 29:1046-51 (2011)  
Target
Name:
Serine/threonine-protein kinase SIK3 [59-1321]
Synonyms:
KIAA0999 QSK SIK3 Salt-inducible kinase 3 Serine/threonine-protein kinase SIK3
Type:
PROTEIN
Mol. Mass.:
139984.87
Organism:
Homo sapiens (Human)
Description:
ChEMBL_774254
Residue:
1263
  
Inhibitor
Name:
BDBM25617
Synonyms:
N-[3-({5-chloro-1H-pyrrolo[2,3-b]pyridin-3-yl}carbonyl)-2,4-difluorophenyl]propane-1-sulfonamide | PLX4720
Type:
Small organic molecule
Emp. Form.:
C17H14ClF2N3O3S
Mol. Mass.:
413.826
SMILES:
CCCS(=O)(=O)Nc1ccc(F)c(C(=O)c2c[nH]c3ncc(Cl)cc23)c1F
: