Target
Mitogen-activated protein kinase kinase kinase 10
Ligand
BDBM50355497
Substrate
Meas. Tech.
ChEMBL_774347 (CHEMBL1908564)
Kd
>10000±n/a nM
Citation
 Davis, MIHunt, JPHerrgard, SCiceri, PWodicka, LMPallares, GHocker, MTreiber, DKZarrinkar, PP Comprehensive analysis of kinase inhibitor selectivity. Nat Biotechnol 29:1046-51 (2011)  
Target
Name:
Mitogen-activated protein kinase kinase kinase 10
Synonyms:
M3K10_HUMAN MLK2 Mitogen-activated protein kinase kinase kinase 10 | Mixed Lineage Kinase 2 (MLK2)
Type:
PROTEIN
Mol. Mass.:
103699.30
Organism:
Homo sapiens (Human)
Description:
ChEMBL_1460564
Residue:
954
  
Inhibitor
Name:
BDBM50355497
Synonyms:
AZD-6244 | CHEMBL1614701
Type:
Small organic molecule
Emp. Form.:
C17H15BrClFN4O3
Mol. Mass.:
457.681
SMILES:
Cn1cnc2c(F)c(Nc3ccc(Br)cc3Cl)c(cc12)C(=O)NOCCO
: