Target
5'-AMP-activated protein kinase catalytic subunit alpha-1
Ligand
BDBM50128285
Substrate
Meas. Tech.
ChEMBL_774253 (CHEMBL1908470)
Kd
>10000±n/a nM
Citation
 Davis, MIHunt, JPHerrgard, SCiceri, PWodicka, LMPallares, GHocker, MTreiber, DKZarrinkar, PP Comprehensive analysis of kinase inhibitor selectivity. Nat Biotechnol 29:1046-51 (2011)  
Target
Name:
5'-AMP-activated protein kinase catalytic subunit alpha-1
Synonyms:
AAPK1_HUMAN AMP-activated protein kinase alpha-1/beta-2/gamma-2 AMPK subunit alpha-1 AMPK1 PRKAA1 | Tau-protein kinase PRKAA1
Type:
Protein
Mol. Mass.:
64023.62
Organism:
Homo sapiens (Human)
Description:
Q13131
Residue:
559
  
Inhibitor
Name:
BDBM50128285
Synonyms:
3-(1-Methyl-1H-indol-3-yl)-4-[1-(1-pyridin-2-ylmethyl-piperidin-4-yl)-1H-indol-3-yl]-pyrrole-2,5-dione | CHEMBL300138
Type:
Small organic molecule
Emp. Form.:
C32H29N5O2
Mol. Mass.:
515.605
SMILES:
Cn1cc(C2=C(C(=O)NC2=O)c2cn(C3CCN(Cc4ccccn4)CC3)c3ccccc23)c2ccccc12
: