Target
MAP/microtubule affinity-regulating kinase 4
Ligand
BDBM25084
Substrate
Meas. Tech.
ChEMBL_774620 (CHEMBL1908837)
Kd
>10000±n/a nM
Citation
 Davis, MIHunt, JPHerrgard, SCiceri, PWodicka, LMPallares, GHocker, MTreiber, DKZarrinkar, PP Comprehensive analysis of kinase inhibitor selectivity. Nat Biotechnol 29:1046-51 (2011)  
Target
Name:
MAP/microtubule affinity-regulating kinase 4
Synonyms:
KIAA1860 MARK4 MARKL1
Type:
PROTEIN
Mol. Mass.:
82561.08
Organism:
Homo sapiens (Human)
Description:
ChEMBL_774620
Residue:
752
  
Inhibitor
Name:
BDBM25084
Synonyms:
3-[2,4-diamino-6-(3-hydroxyphenyl)pteridin-7-yl]phenol TG100-115
Type:
Small organic molecule
Emp. Form.:
C18H14N6O2
Mol. Mass.:
346.3428
SMILES:
Nc1nc(N)c2nc(-c3cccc(O)c3)c(nc2n1)-c1cccc(O)c1
: