Target
Serine/threonine-protein kinase LATS2
Ligand
BDBM50355499
Substrate
Meas. Tech.
ChEMBL_774563 (CHEMBL1908780)
Kd
2100±n/a nM
Citation
 Davis, MIHunt, JPHerrgard, SCiceri, PWodicka, LMPallares, GHocker, MTreiber, DKZarrinkar, PP Comprehensive analysis of kinase inhibitor selectivity. Nat Biotechnol 29:1046-51 (2011)  
Target
Name:
Serine/threonine-protein kinase LATS2
Synonyms:
KPM LATS2_HUMAN
Type:
PROTEIN
Mol. Mass.:
120160.09
Organism:
Homo sapiens (Human)
Description:
ChEMBL_587187
Residue:
1088
  
Inhibitor
Name:
BDBM50355499
Synonyms:
CHEMBL1908395 | CHEMBL1908842
Type:
Small organic molecule
Emp. Form.:
C26H32N6O2
Mol. Mass.:
460.5713
SMILES:
CN(C)CC(=O)N1CCC(CC1)c1ccc(NC(=O)c2ncc([nH]2)C#N)c(c1)C1=CCCCC1
: