Target
Serine/threonine-protein kinase 35
Ligand
BDBM13535
Substrate
Meas. Tech.
ChEMBL_774191 (CHEMBL1908408)
Kd
>10000±n/a nM
Citation
 Davis, MIHunt, JPHerrgard, SCiceri, PWodicka, LMPallares, GHocker, MTreiber, DKZarrinkar, PP Comprehensive analysis of kinase inhibitor selectivity. Nat Biotechnol 29:1046-51 (2011)  
Target
Name:
Serine/threonine-protein kinase 35
Synonyms:
CLIK-1 CLP-36-interacting kinase 1 PDLIM1-interacting kinase 1 STK35L1 Serine/threonine-protein kinase 35 L1
Type:
PROTEIN
Mol. Mass.:
58080.42
Organism:
Homo sapiens (Human)
Description:
ChEMBL_774191
Residue:
534
  
Inhibitor
Name:
BDBM13535
Synonyms:
4-[6-methoxy-7-(3-piperidin-1-ylpropoxy)quinazolin-4-yl]-N-(4-propan-2-yloxyphenyl)piperazine-1-carboxamide 4-[6-methoxy-7-[3-(1-piperidinyl)propoxy]-4-quinazolinyl]-N-(4-propan-2-yloxyphenyl)-1-piperazinecarboxamide CHEMBL124660 MLN518 cid_3038522
Type:
Small organic molecule
Emp. Form.:
C31H42N6O4
Mol. Mass.:
562.703
SMILES:
COc1cc2c(ncnc2cc1OCCCN1CCCCC1)N1CCN(CC1)C(=O)Nc1ccc(OC(C)C)cc1
: