Target
Bone morphogenetic protein receptor type-1B
Ligand
BDBM50242737
Substrate
Meas. Tech.
ChEMBL_774305 (CHEMBL1908522)
Kd
>10000±n/a nM
Citation
 Davis, MIHunt, JPHerrgard, SCiceri, PWodicka, LMPallares, GHocker, MTreiber, DKZarrinkar, PP Comprehensive analysis of kinase inhibitor selectivity. Nat Biotechnol 29:1046-51 (2011)  
Target
Name:
Bone morphogenetic protein receptor type-1B
Synonyms:
ALK-6 BMPR1B Bone morphogenetic protein receptor type-1B (BMPR1B)
Type:
Enzyme
Mol. Mass.:
56939.41
Organism:
Homo sapiens (Human)
Description:
O00238
Residue:
502
  
Inhibitor
Name:
BDBM50242737
Synonyms:
(R,Z)-5-(2,6-dichlorobenzylsulfonyl)-3-((3,5-dimethyl-4-(2-(pyrrolidin-1-ylmethyl)pyrrolidine-1-carbonyl)-1H-pyrrol-2-yl)methylene)indolin-2-one PHA-665752 | TCMDC-125885
Type:
Small organic molecule
Emp. Form.:
C32H34Cl2N4O4S
Mol. Mass.:
641.608
SMILES:
Cc1[nH]c(\C=C2/C(=O)Nc3ccc(cc23)S(=O)(=O)Cc2c(Cl)cccc2Cl)c(C)c1C(=O)N1CCC[C@@H]1CN1CCCC1
: