Target
Serine/threonine-protein kinase PAK 6
Ligand
BDBM50355494
Substrate
Meas. Tech.
ChEMBL_774595 (CHEMBL1908812)
Kd
>10000±n/a nM
Citation
 Davis, MIHunt, JPHerrgard, SCiceri, PWodicka, LMPallares, GHocker, MTreiber, DKZarrinkar, PP Comprehensive analysis of kinase inhibitor selectivity. Nat Biotechnol 29:1046-51 (2011)  
Target
Name:
Serine/threonine-protein kinase PAK 6
Synonyms:
PAK5 PAK6_HUMAN Serine/threonine-protein kinase PAK6
Type:
PROTEIN
Mol. Mass.:
74897.61
Organism:
Homo sapiens (Human)
Description:
ChEMBL_1513397
Residue:
681
  
Inhibitor
Name:
BDBM50355494
Synonyms:
CHEMBL1908396
Type:
Small organic molecule
Emp. Form.:
C24H24N4O5S
Mol. Mass.:
480.536
SMILES:
COc1cc(Oc2ccnc3cc(OC)c(OC)cc23)ccc1NC(=O)NC(C)c1nccs1
: