Target
Rho-associated protein kinase 1
Ligand
BDBM25117
Substrate
Meas. Tech.
ChEMBL_774495 (CHEMBL1908712)
Kd
>10000±n/a nM
Citation
 Davis, MIHunt, JPHerrgard, SCiceri, PWodicka, LMPallares, GHocker, MTreiber, DKZarrinkar, PP Comprehensive analysis of kinase inhibitor selectivity. Nat Biotechnol 29:1046-51 (2011)  
Target
Name:
Rho-associated protein kinase 1
Synonyms:
ROCK-I ROCK1_HUMAN Rho-associated protein kinase Rho-associated, coiled-coil-containing protein kinase 1 Rho-kinase (ROCK I) p160 ROCK-1 | p160ROCK
Type:
Serine/threonine-protein kinase
Mol. Mass.:
158156.77
Organism:
Homo sapiens (Human)
Description:
Q13464
Residue:
1354
  
Inhibitor
Name:
BDBM25117
Synonyms:
AG-013736 N-methyl-2-({3-[(E)-2-(pyridin-2-yl)ethenyl]-1H-indazol-6-yl}sulfanyl)benzamide US9205078, Axitinib | US9617222, Compound A
Type:
Small organic molecule
Emp. Form.:
C22H18N4OS
Mol. Mass.:
386.47
SMILES:
CNC(=O)c1ccccc1Sc1ccc2c(\C=C\c3ccccn3)n[nH]c2c1
: