Target
cGMP-dependent protein kinase 2
Ligand
BDBM25013
Substrate
Meas. Tech.
ChEMBL_774533 (CHEMBL1908750)
Kd
3.1±n/a nM
Citation
 Davis, MIHunt, JPHerrgard, SCiceri, PWodicka, LMPallares, GHocker, MTreiber, DKZarrinkar, PP Comprehensive analysis of kinase inhibitor selectivity. Nat Biotechnol 29:1046-51 (2011)  
Target
Name:
cGMP-dependent protein kinase 2
Synonyms:
CGK 2 PRKG2 Type II cGMP-dependent protein kinase | cGKII
Type:
PROTEIN
Mol. Mass.:
87448.25
Organism:
Homo sapiens (Human)
Description:
ChEMBL_774533
Residue:
762
  
Inhibitor
Name:
BDBM25013
Synonyms:
4-[2-(4-amino-1,2,5-oxadiazol-3-yl)-1-ethyl-7-[(3S)-piperidin-3-ylmethoxy]-1H-imidazo[4,5-c]pyridin-4-yl]-2-methylbut-3-yn-2-ol GSK690693 | US10550114, Compound GSK690693
Type:
Small organic molecule
Emp. Form.:
C21H27N7O3
Mol. Mass.:
425.4842
SMILES:
CCn1c(nc2c(ncc(OC[C@H]3CCCNC3)c12)C#CC(C)(C)O)-c1nonc1N
: