Target
Serine/threonine-protein kinase ICK
Ligand
BDBM4814
Substrate
Meas. Tech.
ChEMBL_774570 (CHEMBL1908787)
Kd
470±n/a nM
Citation
 Davis, MIHunt, JPHerrgard, SCiceri, PWodicka, LMPallares, GHocker, MTreiber, DKZarrinkar, PP Comprehensive analysis of kinase inhibitor selectivity. Nat Biotechnol 29:1046-51 (2011)  
Target
Name:
Serine/threonine-protein kinase ICK
Synonyms:
CILK1 ICK KIAA0936 Laryngeal cancer kinase 2 MRK | hICK
Type:
PROTEIN
Mol. Mass.:
71470.23
Organism:
Homo sapiens (Human)
Description:
ChEMBL_774570
Residue:
632
  
Inhibitor
Name:
BDBM4814
Synonyms:
CHEMBL535 N-[2-(diethylamino)ethyl]-5-{[(3Z)-5-fluoro-2-oxo-2,3-dihydro-1H-indol-3-ylidene]methyl}-2,4-dimethyl-1H-pyrrole-3-carboxamide SUNITINIB US10464902, Sunitinib US9163010, Sunitinib | US9914707, SU11248
Type:
Small organic molecule
Emp. Form.:
C22H27FN4O2
Mol. Mass.:
398.4738
SMILES:
CCN(CC)CCNC(=O)c1c(C)[nH]c(\C=C2/C(=O)Nc3ccc(F)cc23)c1C
: