Target
Cyclin-dependent kinase 2 homolog
Ligand
BDBM25013
Substrate
Meas. Tech.
ChEMBL_774240 (CHEMBL1908457)
Kd
>10000±n/a nM
Citation
 Davis, MIHunt, JPHerrgard, SCiceri, PWodicka, LMPallares, GHocker, MTreiber, DKZarrinkar, PP Comprehensive analysis of kinase inhibitor selectivity. Nat Biotechnol 29:1046-51 (2011)  
Target
Name:
Cyclin-dependent kinase 2 homolog
Synonyms:
CDK2H_PLAF7 Cell division control protein 2 homolog | PK5
Type:
PROTEIN
Mol. Mass.:
33000.81
Organism:
Plasmodium falciparum (isolate 3D7)
Description:
ChEMBL_774240
Residue:
288
  
Inhibitor
Name:
BDBM25013
Synonyms:
4-[2-(4-amino-1,2,5-oxadiazol-3-yl)-1-ethyl-7-[(3S)-piperidin-3-ylmethoxy]-1H-imidazo[4,5-c]pyridin-4-yl]-2-methylbut-3-yn-2-ol GSK690693 | US10550114, Compound GSK690693
Type:
Small organic molecule
Emp. Form.:
C21H27N7O3
Mol. Mass.:
425.4842
SMILES:
CCn1c(nc2c(ncc(OC[C@H]3CCCNC3)c12)C#CC(C)(C)O)-c1nonc1N
: