Target
cAMP-dependent protein kinase catalytic subunit beta
Ligand
BDBM50355496
Substrate
Meas. Tech.
ChEMBL_774362 (CHEMBL1908579)
Kd
>10000±n/a nM
Citation
 Davis, MIHunt, JPHerrgard, SCiceri, PWodicka, LMPallares, GHocker, MTreiber, DKZarrinkar, PP Comprehensive analysis of kinase inhibitor selectivity. Nat Biotechnol 29:1046-51 (2011)  
Target
Name:
cAMP-dependent protein kinase catalytic subunit beta
Synonyms:
KAPCB_HUMAN PKAC-beta cAMP-dependent protein kinase (PKA) cAMP-dependent protein kinase catalytic subunit beta
Type:
PROTEIN
Mol. Mass.:
40631.25
Organism:
Homo sapiens (Human)
Description:
ChEMBL_586348
Residue:
351
  
Inhibitor
Name:
BDBM50355496
Synonyms:
CHEMBL1908397
Type:
Small organic molecule
Emp. Form.:
C20H20N4O
Mol. Mass.:
332.399
SMILES:
O=C(N1CCNCC1)c1ccc(\C=C\c2n[nH]c3ccccc23)cc1
: