Target
Macrophage colony-stimulating factor 1 receptor
Ligand
BDBM50355499
Substrate
Meas. Tech.
ChEMBL_774475 (CHEMBL1908692)
Kd
3.2±n/a nM
Citation
 Davis, MIHunt, JPHerrgard, SCiceri, PWodicka, LMPallares, GHocker, MTreiber, DKZarrinkar, PP Comprehensive analysis of kinase inhibitor selectivity. Nat Biotechnol 29:1046-51 (2011)  
Target
Name:
Macrophage colony-stimulating factor 1 receptor
Synonyms:
CSF1R FMS Macrophage colony stimulating factor receptor Macrophage colony-stimulating factor 1 receptor (c-FMS) Proto-oncogene c-Fms c-fms | cFMS
Type:
Protein
Mol. Mass.:
107979.48
Organism:
Homo sapiens (Human)
Description:
P07333
Residue:
972
  
Inhibitor
Name:
BDBM50355499
Synonyms:
CHEMBL1908395 | CHEMBL1908842
Type:
Small organic molecule
Emp. Form.:
C26H32N6O2
Mol. Mass.:
460.5713
SMILES:
CN(C)CC(=O)N1CCC(CC1)c1ccc(NC(=O)c2ncc([nH]2)C#N)c(c1)C1=CCCCC1
: