Target
Serine/threonine-protein kinase TAO2
Ligand
BDBM32362
Substrate
Meas. Tech.
ChEMBL_774579 (CHEMBL1908796)
Kd
>10000±n/a nM
Citation
 Davis, MIHunt, JPHerrgard, SCiceri, PWodicka, LMPallares, GHocker, MTreiber, DKZarrinkar, PP Comprehensive analysis of kinase inhibitor selectivity. Nat Biotechnol 29:1046-51 (2011)  
Target
Name:
Serine/threonine-protein kinase TAO2
Synonyms:
KIAA0881 PSK TAOK2 | TAOK2_HUMAN
Type:
Enzyme
Mol. Mass.:
138262.36
Organism:
Homo sapiens (Human)
Description:
Q9UL54
Residue:
1235
  
Inhibitor
Name:
BDBM32362
Synonyms:
5-[[3-methoxy-4-[(4-methoxyphenyl)methoxy]phenyl]methyl]pyrimidine-2,4-diamine [2-amino-5-(3-methoxy-4-p-anisyloxy-benzyl)pyrimidin-4-yl]amine | cid_11617559
Type:
Small organic molecule
Emp. Form.:
C20H22N4O3
Mol. Mass.:
366.4137
SMILES:
COc1ccc(COc2ccc(Cc3cnc(N)nc3N)cc2OC)cc1
: