Target
Protein-arginine deiminase type-1
Ligand
BDBM50355658
Substrate
Meas. Tech.
ChEMBL_776878 (CHEMBL1914012)
IC50
29000±n/a nM
Citation
 Causey, CPJones, JESlack, JLKamei, DJones, LESubramanian, VKnuckley, BEbrahimi, PChumanevich, AALuo, YHashimoto, HSato, MHofseth, LJThompson, PR The development of N-a-(2-carboxyl)benzoyl-N(5)-(2-fluoro-1-iminoethyl)-l-ornithine amide (o-F-amidine) and N-a-(2-carboxyl)benzoyl-N(5)-(2-chloro-1-iminoethyl)-l-ornithine amide (o-Cl-amidine) as second generation protein arginine deiminase (PAD) inhibitors. J Med Chem 54:6919-35 (2011)  
Target
Name:
Protein-arginine deiminase type-1
Synonyms:
PAD1 PADI1_HUMAN Peptidylarginine deiminase I | Protein-arginine deiminase type I
Type:
PROTEIN
Mol. Mass.:
74664.17
Organism:
Homo sapiens (Human)
Description:
ChEMBL_1290380
Residue:
663
  
Inhibitor
Name:
BDBM50355658
Synonyms:
CHEMBL1910973
Type:
Small organic molecule
Emp. Form.:
C14H19FN4O2
Mol. Mass.:
294.3247
SMILES:
NC(=O)[C@H](CCCN=C(N)CF)NC(=O)c1ccccc1
: