Target
Polyunsaturated fatty acid 5-lipoxygenase
Ligand
BDBM50357364
Substrate
Meas. Tech.
ChEMBL_787590 (CHEMBL1917983)
IC50
420±n/a nM
Citation
 Shaari, KSuppaiah, VWai, LKStanslas, JTejo, BAIsraf, DAAbas, FIsmail, ISShuaib, NHZareen, SLajis, NH Bioassay-guided identification of an anti-inflammatory prenylated acylphloroglucinol from Melicope ptelefolia and molecular insights into its interaction with 5-lipoxygenase. Bioorg Med Chem 19:6340-7 (2011)  
Target
Name:
Polyunsaturated fatty acid 5-lipoxygenase
Synonyms:
5-LO 5-Lipoxygenase (5-LO) 5-Lipoygenase ALOX5 LOG5 | LOX5_HUMAN
Type:
Enzyme
Mol. Mass.:
77972.74
Organism:
Homo sapiens (Human)
Description:
Recombinant protein was purified from E. coli lysate. After ammonium sulfate precipitation and subsequent steps, the supernatant (S100) was used for 5-LO activity assay.
Residue:
674
  
Inhibitor
Name:
BDBM50357364
Synonyms:
CHEMBL1242095
Type:
Small organic molecule
Emp. Form.:
C18H24O4
Mol. Mass.:
304.3808
SMILES:
[#6]\[#6](-[#6])=[#6]\[#6]-[#6]\[#6](-[#6])=[#6]\[#6]-c1c(-[#8])cc(-[#8])c(-[#6](-[#6])=O)c1-[#8]
: