Target
Melanin-concentrating hormone receptor 1
Ligand
BDBM50357504
Substrate
Meas. Tech.
ChEMBL_787536 (CHEMBL1919497)
IC50
7.3±n/a nM
Citation
 Kasai, SKamaura, MKamata, MAso, KOgino, HNakano, YWatanabe, KKaisho, TTawada, MNagisa, YTakekawa, SKato, KSuzuki, NIshihara, Y Melanin-concentrating hormone receptor 1 antagonists: synthesis, structure-activity relationship, docking studies, and biological evaluation of 2,3,4,5-tetrahydro-1H-3-benzazepine derivatives. Bioorg Med Chem 19:6261-73 (2011)  
Target
Name:
Melanin-concentrating hormone receptor 1
Synonyms:
G-protein coupled receptor 24 MCH receptor 1 MCH-R1 MCHR MCHR1_RAT Melanin Concentrating Hormone 1 Melanin-concentrating hormone receptor 1 Slc1 | Somatostatin receptor-like protein
Type:
Enzyme Catalytic Domain
Mol. Mass.:
39075.64
Organism:
RAT
Description:
Melanin Concentrating Hormone 1 GPR24 RAT::P97639
Residue:
353
  
Inhibitor
Name:
BDBM50357504
Synonyms:
CHEMBL1914633
Type:
Small organic molecule
Emp. Form.:
C29H35ClN2O2
Mol. Mass.:
479.053
SMILES:
Clc1ccc(cc1)C1CCN(CCCC(=O)c2ccc3CCN(CCc3c2)C(=O)C2CC2)CC1
: