Target
Sphingosine 1-phosphate receptor 1
Ligand
BDBM50357770
Substrate
Meas. Tech.
ChEMBL_786287 (CHEMBL1920392)
EC50
297±n/a nM
Citation
 Buzard, DHan, SThoresen, LMoody, JLopez, LKawasaki, ASchrader, TSage, CGao, YEdwards, JBarden, JThatte, JFu, LSolomon, MLiu, LAl-Shamma, HGatlin, JLe, MXing, CEspinola, SJones, RM Discovery and characterization of potent and selective 4-oxo-4-(5-(5-phenyl-1,2,4-oxadiazol-3-yl)indolin-1-yl)butanoic acids as S1P¿? agonists. Bioorg Med Chem Lett 21:6013-8 (2011)  
Target
Name:
Sphingosine 1-phosphate receptor 1
Synonyms:
CHEDG1 Endothelial differentiation G-protein coupled receptor 1 S1P1 S1PR1_HUMAN Sphingosine 1-phosphate receptor Edg-1
Type:
Enzyme
Mol. Mass.:
42836.02
Organism:
Homo sapiens (Human)
Description:
P21453
Residue:
382
  
Inhibitor
Name:
BDBM50357770
Synonyms:
CHEMBL1916407
Type:
Small organic molecule
Emp. Form.:
C23H18F6N4O3
Mol. Mass.:
512.4044
SMILES:
COC(=O)CCCCn1cc2cc(ccc2n1)-c1noc(n1)-c1cc(cc(c1)C(F)(F)F)C(F)(F)F
: