Target
Rod cGMP-specific 3',5'-cyclic phosphodiesterase subunit alpha
Ligand
BDBM50357828
Substrate
Meas. Tech.
ChEMBL_787242 (CHEMBL1918964)
IC50
1330±n/a nM
Citation
 Malamas, MSNi, YErdei, JStange, HSchindler, RLankau, HJGrunwald, CFan, KYParris, KLangen, BEgerland, UHage, TMarquis, KLGrauer, SBrennan, JNavarra, RGraf, RHarrison, BLRobichaud, AKronbach, TPangalos, MNHoefgen, NBrandon, NJ Highly potent, selective, and orally active phosphodiesterase 10A inhibitors. J Med Chem 54:7621-38 (2011)  
Target
Name:
Rod cGMP-specific 3',5'-cyclic phosphodiesterase subunit alpha
Synonyms:
PDE6A PDEA Phosphodiesterase 6A
Type:
Enzyme
Mol. Mass.:
99320.22
Organism:
Bos taurus (Bovine)
Description:
P11541
Residue:
859
  
Inhibitor
Name:
BDBM50357828
Synonyms:
CHEMBL1915912
Type:
Small organic molecule
Emp. Form.:
C17H17N5OS
Mol. Mass.:
339.415
SMILES:
COc1ccc2nc(C)c3c(C)nc(-c4sc(C)nc4C)n3c2n1
: