Target
Dual specificity calcium/calmodulin-dependent 3',5'-cyclic nucleotide phosphodiesterase 1B
Ligand
BDBM50319165
Substrate
Meas. Tech.
ChEMBL_787237 (CHEMBL1918959)
IC50
>5000±n/a nM
Citation
 Malamas, MSNi, YErdei, JStange, HSchindler, RLankau, HJGrunwald, CFan, KYParris, KLangen, BEgerland, UHage, TMarquis, KLGrauer, SBrennan, JNavarra, RGraf, RHarrison, BLRobichaud, AKronbach, TPangalos, MNHoefgen, NBrandon, NJ Highly potent, selective, and orally active phosphodiesterase 10A inhibitors. J Med Chem 54:7621-38 (2011)  
Target
Name:
Dual specificity calcium/calmodulin-dependent 3',5'-cyclic nucleotide phosphodiesterase 1B
Synonyms:
63 kDa Cam-PDE Calcium/calmodulin-dependent 3',5'-cyclic nucleotide phosphodiesterase 1B PDE1B PDE1B_HUMAN Phosphodiesterase 1B Phosphodiesterase Type 1 (PDE1B) | Phosphodiesterase, PDE1/PDE5
Type:
Enzyme
Mol. Mass.:
61366.51
Organism:
Homo sapiens (Human)
Description:
Residue:
536
  
Inhibitor
Name:
BDBM50319165
Synonyms:
2-methoxy-6,7-dimethyl-9-propylimidazo[1,5-a]pyrido[3,2-e]pyrazine CHEMBL1086110
Type:
Small organic molecule
Emp. Form.:
C15H18N4O
Mol. Mass.:
270.3296
SMILES:
CCCc1nc(C)c2c(C)nc3ccc(OC)nc3n12
: