Target
Beta-secretase 2
Ligand
BDBM50358928
Substrate
Meas. Tech.
ChEMBL_790907 (CHEMBL1926455)
IC50
3173±n/a nM
Citation
 Al-Tel, THSemreen, MHAl-Qawasmeh, RASchmidt, MFEl-Awadi, RArdah, MZaarour, RRao, SNEl-Agnaf, O Design, synthesis, and qualitative structure-activity evaluations of novelß-secretase inhibitors as potential Alzheimer's drug leads. J Med Chem 54:8373-85 (2011)  
Target
Name:
Beta-secretase 2
Synonyms:
AEPLC ASP1 Asp 1 Aspartyl protease 1 BACE2_HUMAN Beta-secretase (BACE) Beta-secretase 2 (BACE-2) Beta-site APP-cleaving enzyme 2 Memapsin-1 beta-Secretase (BACE-2)
Type:
Protein
Mol. Mass.:
56171.20
Organism:
Homo sapiens (Human)
Description:
Q9Y5Z0
Residue:
518
  
Inhibitor
Name:
BDBM50358928
Synonyms:
CHEMBL1923752
Type:
Small organic molecule
Emp. Form.:
C20H13FN4
Mol. Mass.:
328.3424
SMILES:
Fc1ccc2nc([nH]c2c1)-c1cccc(c1)-c1cn2ccccc2n1
: