Target
17-beta-hydroxysteroid dehydrogenase type 1
Ligand
BDBM50360234
Substrate
Meas. Tech.
ChEMBL_794211 (CHEMBL1932036)
IC50
19646±n/a nM
Citation
 Wetzel, MGargano, EMHinsberger, SMarchais-Oberwinkler, SHartmann, RW Discovery of a new class of bicyclic substituted hydroxyphenylmethanones as 17ß-hydroxysteroid dehydrogenase type 2 (17ß-HSD2) inhibitors for the treatment of osteoporosis. Eur J Med Chem 47:1-17 (2012)  
Target
Name:
17-beta-hydroxysteroid dehydrogenase type 1
Synonyms:
17-beta-HSD 1 17-beta-hydroxysteroid dehydrogenase type 1 20-alpha-HSD E17KSR EDH17B1 EDHB17 Estradiol 17-beta-dehydrogenase 1 (17beta-HSD1) Placental 17-beta-hydroxysteroid dehydrogenase | SDR28C1
Type:
Enzyme
Mol. Mass.:
34945.13
Organism:
Homo sapiens (Human)
Description:
P14061
Residue:
328
  
Inhibitor
Name:
BDBM50360234
Synonyms:
CHEMBL1928188
Type:
Small organic molecule
Emp. Form.:
C19H15NO3
Mol. Mass.:
305.3273
SMILES:
Cc1cc(ccc1O)-c1cccc(n1)C(=O)c1cccc(O)c1
: