Target
Androgen receptor
Ligand
BDBM50360446
Substrate
Meas. Tech.
ChEMBL_796526 (CHEMBL1937841)
IC50
25±n/a nM
Citation
 Yamamoto, SMatsunaga, NHitaka, TYamada, MHara, TMiyazaki, JSantou, TKusaka, MYamaoka, MKanzaki, NFuruya, STasaka, AHamamura, KIto, M Design, synthesis, and biological evaluation of 4-phenylpyrrole derivatives as novel androgen receptor antagonists. Bioorg Med Chem 20:422-34 (2011)  
Target
Name:
Androgen receptor
Synonyms:
ANDR_HUMAN Androgen Receptor Androgen receptor/Baculoviral IAP repeat-containing protein 2 Dihydrotestosterone receptor Nuclear receptor subfamily 3 group C member 4
Type:
Receptor
Mol. Mass.:
99185.27
Organism:
Homo sapiens (Human)
Description:
CHO cells were stably transfected with human AR gene.
Residue:
920
  
Inhibitor
Name:
BDBM50360446
Synonyms:
CHEMBL1934446
Type:
Small organic molecule
Emp. Form.:
C21H17ClN4O
Mol. Mass.:
376.839
SMILES:
Cc1c(C#N)c(c(C)n1Cc1cnc(Cl)c(CO)c1)-c1ccc(cc1)C#N
: