Target
Androgen receptor
Ligand
BDBM50360429
Substrate
Meas. Tech.
ChEMBL_796524 (CHEMBL1937839)
IC50
5.5±n/a nM
Citation
 Yamamoto, SMatsunaga, NHitaka, TYamada, MHara, TMiyazaki, JSantou, TKusaka, MYamaoka, MKanzaki, NFuruya, STasaka, AHamamura, KIto, M Design, synthesis, and biological evaluation of 4-phenylpyrrole derivatives as novel androgen receptor antagonists. Bioorg Med Chem 20:422-34 (2011)  
Target
Name:
Androgen receptor
Synonyms:
ANDR_HUMAN Androgen Receptor Androgen receptor/Baculoviral IAP repeat-containing protein 2 Dihydrotestosterone receptor Nuclear receptor subfamily 3 group C member 4
Type:
Receptor
Mol. Mass.:
99185.27
Organism:
Homo sapiens (Human)
Description:
CHO cells were stably transfected with human AR gene.
Residue:
920
  
Inhibitor
Name:
BDBM50360429
Synonyms:
CHEMBL1934430
Type:
Small organic molecule
Emp. Form.:
C22H22N2O4
Mol. Mass.:
378.4211
SMILES:
CCOC(=O)c1c(C)n(Cc2ccccc2)c(C)c1-c1ccc(cc1)[N+]([O-])=O
: