Target
Histone deacetylase 6
Ligand
BDBM50361265
Substrate
Meas. Tech.
ChEMBL_795337 (CHEMBL1937193)
Kd
>100000±n/a nM
Citation
 Henkes, LMHaus, PJäger, FLudwig, JMeyer-Almes, FJ Synthesis and biochemical analysis of 2,2,3,3,4,4,5,5,6,6,7,7-dodecafluoro-N-hydroxy-octanediamides as inhibitors of human histone deacetylases. Bioorg Med Chem 20:985-95 (2012)  
Target
Name:
Histone deacetylase 6
Synonyms:
Cereblon/Histone deacetylase 6 HDAC6 Histone deacetylase 6 (HDAC6) KIAA0901 | ORF Names:JM21
Type:
Chromatin regulator; hydrolase; repressor
Mol. Mass.:
131381.51
Organism:
Homo sapiens (Human)
Description:
Q9UBN7
Residue:
1215
  
Inhibitor
Name:
BDBM50361265
Synonyms:
CHEMBL1934907
Type:
Small organic molecule
Emp. Form.:
C22H12F12N2O3
Mol. Mass.:
580.3231
SMILES:
ONC(=O)C(F)(F)C(F)(F)C(F)(F)C(F)(F)C(F)(F)C(F)(F)C(=O)Nc1ccc2cc3ccccc3cc2c1
: