Target
Histone deacetylase 7
Ligand
BDBM50361263
Substrate
Meas. Tech.
ChEMBL_795338 (CHEMBL1937194)
Kd
11000±n/a nM
Citation
 Henkes, LMHaus, PJäger, FLudwig, JMeyer-Almes, FJ Synthesis and biochemical analysis of 2,2,3,3,4,4,5,5,6,6,7,7-dodecafluoro-N-hydroxy-octanediamides as inhibitors of human histone deacetylases. Bioorg Med Chem 20:985-95 (2012)  
Target
Name:
Histone deacetylase 7
Synonyms:
HD7 HDAC7A Histone acetylase 7 (HDAC7) Human HDAC7
Type:
Chromatin regulator; hydrolase; repressor
Mol. Mass.:
102942.62
Organism:
Homo sapiens (Human)
Description:
Q8WUI4
Residue:
952
  
Inhibitor
Name:
BDBM50361263
Synonyms:
CHEMBL1934905
Type:
Small organic molecule
Emp. Form.:
C18H10F12N2O3
Mol. Mass.:
530.2644
SMILES:
ONC(=O)C(F)(F)C(F)(F)C(F)(F)C(F)(F)C(F)(F)C(F)(F)C(=O)Nc1ccc2ccccc2c1
: