Target
Vascular endothelial growth factor receptor 2
Ligand
BDBM50362781
Substrate
Meas. Tech.
ChEMBL_797905 (CHEMBL1942686)
IC50
1400±n/a nM
Citation
 Kinoshita, KAsoh, KFuruichi, NIto, TKawada, HHara, SOhwada, JMiyagi, TKobayashi, TTakanashi, KTsukaguchi, TSakamoto, HTsukuda, TOikawa, N Design and synthesis of a highly selective, orally active and potent anaplastic lymphoma kinase inhibitor (CH5424802). Bioorg Med Chem 20:1271-80 (2012)  
Target
Name:
Vascular endothelial growth factor receptor 2
Synonyms:
CD_antigen=CD309 Fetal liver kinase 1 (FLK-1) KDR Protein-tyrosine kinase receptor Flk-1 VEGFR-2 VEGFR2 Vascular Endothelial Growth Factor Receptor Kinase 2 Vascular endothelial growth factor receptor 2 (KDR) Vascular endothelial growth factor receptor 2 (VEGFR2) Vascular endothelial growth factor receptor-2 (VEGFR-2)
Type:
Receptor Tyrosine Kinase
Mol. Mass.:
151510.97
Organism:
Homo sapiens (Human)
Description:
P35968
Residue:
1356
  
Inhibitor
Name:
BDBM50362781
Synonyms:
1256580-46-7 Alecensa CH5424802 US10851092, Example Alectinib US9126931, 366
Type:
Small organic molecule
Emp. Form.:
C30H34N4O2
Mol. Mass.:
482.6166
SMILES:
CCc1cc2C(=O)c3c([nH]c4cc(ccc34)C#N)C(C)(C)c2cc1N1CCC(CC1)N1CCOCC1
: