Target
Tyrosine-protein phosphatase non-receptor type 9
Ligand
BDBM50363864
Substrate
Meas. Tech.
ChEMBL_802235 (CHEMBL1949393)
IC50
>10000000±n/a nM
Citation
 Wang, QZhu, MZhu, RLu, LYuan, CXing, SFu, XMei, YHang, Q Exploration ofa-aminophosphonate N-derivatives as novel, potent and selective inhibitors of protein tyrosine phosphatases. Eur J Med Chem 49:354-64 (2012)  
Target
Name:
Tyrosine-protein phosphatase non-receptor type 9
Synonyms:
3.1.3.48 PTP-MEG2 PTPase MEG2 Protein-tyrosine phosphatase MEG2 (PTP-Meg2) | Tyrosine-protein phosphatase non-receptor type 9
Type:
Mol. Mass.:
68030.33
Organism:
Homo sapiens (Human)
Description:
P43378
Residue:
593
  
Inhibitor
Name:
BDBM50363864
Synonyms:
CHEMBL1946385
Type:
Small organic molecule
Emp. Form.:
C21H32N2O8P2
Mol. Mass.:
502.4349
SMILES:
CCOP(O)(=O)C(NCCCNC(c1ccccc1O)P(O)(=O)OCC)c1ccccc1O
: